Target
5-hydroxytryptamine receptor 1D
Ligand
BDBM50083151
Substrate
Meas. Tech.
ChEMBL_1700 (CHEMBL616907)
IC50
5±n/a nM
Citation
 Russell, MGMatassa, VGPengilley, RRvan Niel, MBSohal, BWatt, APHitzel, LBeer, MSStanton, JABroughton, HBCastro, JL 3-[3-(Piperidin-1-yl)propyl]indoles as highly selective h5-HT(1D) receptor agonists. J Med Chem 42:4981-5001 (2000)  
Target
Name:
5-hydroxytryptamine receptor 1D
Synonyms:
5-HT-1D 5-HT1D 5HT1D_HUMAN HTR1DA Serotonin (5-HT) receptor | Serotonin Receptor 1D
Type:
G Protein-Coupled Receptor (GPCR)
Mol. Mass.:
41920.63
Organism:
Homo sapiens (Human)
Description:
Receptor binding assays were performed using human clone stably expressed in CHO cells.
Residue:
377
  
Inhibitor
Name:
BDBM50083151
Synonyms:
CHEMBL344537 | [(R)-1-(4-Fluoro-phenyl)-2-methoxy-ethyl]-{1-[3-(5-[1,2,4]triazol-1-ylmethyl-1H-indol-3-yl)-propyl]-piperidin-4-yl}-amine
Type:
Small organic molecule
Emp. Form.:
C28H35FN6O
Mol. Mass.:
490.6155
SMILES:
COC[C@H](NC1CCN(CCCc2c[nH]c3ccc(Cn4cncn4)cc23)CC1)c1ccc(F)cc1
: