Target
Prothrombin
Ligand
BDBM50083548
Substrate
Meas. Tech.
ChEBML_208899
Ki
32000.0±n/a nM
Citation
 Ono, SKuwahara, STakeuchi, MSakashita, HNaito, YKondo, T Syntheses and evaluation of amidinobenzofuran derivatives as tryptase inhibitors. Bioorg Med Chem Lett 9:3285-90 (2000)  
Target
Name:
Prothrombin
Synonyms:
Activation peptide fragment 1 Coagulation factor II Prothrombin precursor Thrombin heavy chain | Thrombin light chain
Type:
Protein
Mol. Mass.:
70029.57
Organism:
Homo sapiens (Human)
Description:
P00734
Residue:
622
  
Inhibitor
Name:
BDBM50083548
Synonyms:
1-{4-[5-amino(imino)methylbenzo[b]furan-2-ylcarbonyl]hexahydro-1-pyrazinyl}-2-[4-(2-{4-[5-amino(imino)methylbenzo[b]furan-2-ylcarbonyl]hexahydro-1-pyrazinyl}-2-oxoethoxy)phenoxy]-1-ethanone | CHEMBL322345
Type:
Small organic molecule
Emp. Form.:
C38H38N8O8
Mol. Mass.:
734.7571
SMILES:
NC(=N)c1ccc2oc(cc2c1)C(=O)N1CCN(CC1)C(=O)COc1ccc(OCC(=O)N2CCN(CC2)C(=O)c2cc3cc(ccc3o2)C(N)=N)cc1
: