Target
Muscarinic acetylcholine receptor M2
Ligand
BDBM50083651
Substrate
Meas. Tech.
ChEMBL_138483 (CHEMBL749096)
Ki
0.075858±n/a nM
Citation
 Krishnan, VPham, WNMesser, WSPeseckis, SM First fatty acylated dipeptides to affect muscarinic receptor ligand binding. Bioorg Med Chem Lett 9:3363-8 (2000)  
Target
Name:
Muscarinic acetylcholine receptor M2
Synonyms:
ACM2_HUMAN Cholinergic, muscarinic M2 Muscarinic acetylcholine receptor M2 and M5 | RecName: Full=Muscarinic acetylcholine receptor M2
Type:
GPCR
Mol. Mass.:
51730.61
Organism:
Homo sapiens (Human)
Description:
P08172
Residue:
466
  
Inhibitor
Name:
BDBM50083651
Synonyms:
(S)-3-Hydroxy-2-(2-tetradecanoylamino-acetylamino)-propionic acid benzyl ester | CHEMBL115078
Type:
Small organic molecule
Emp. Form.:
C26H42N2O5
Mol. Mass.:
462.6221
SMILES:
CCCCCCCCCCCCCC(=O)NCC(=O)N[C@@H](CO)C(=O)OCc1ccccc1
: