Target
Integrin alpha-V/beta-3
Ligand
BDBM50083764
Substrate
Meas. Tech.
ChEMBL_214641 (CHEMBL819721)
Ki
1.3±n/a nM
Citation
 Miller, WHAlberts, DPBhatnagar, PKBondinell, WECallahan, JFCalvo, RRCousins, RDErhard, KFHeerding, DAKeenan, RMKwon, CManley, PJNewlander, KARoss, STSamanen, JMUzinskas, INVenslavsky, JWYuan, CCHaltiwanger, RCGowen, MHwang, SMJames, IELark, MWRieman, DJStroup, GBAzzarano, LMSalyers, KLSmith, BRWard, KWJohanson, KOHuffman, WF Discovery of orally active nonpeptide vitronectin receptor antagonists based on a 2-benzazepine Gly-Asp mimetic. J Med Chem 43:22-6 (2000)  
Target
Name:
Integrin alpha-V/beta-3
Synonyms:
ITGAV/ITGB3 | Integrin beta-3/Vitronectin receptor alpha
Type:
Enzyme
Mol. Mass.:
Description:
Components:
This complex has 2 components.
Component 1
Name:
Integrin alpha-V
Synonyms:
ITAV_HUMAN Integrin alpha-V/alpha-5 VNRA Vitronectin receptor | Vitronectin receptor subunit alpha
Type:
PROTEIN
Mol. Mass.:
116024.92
Organism:
Homo sapiens (Human)
Description:
ChEMBL_582336
Residue:
1048
  
Component 2
Name:
Integrin beta-3
Synonyms:
CD_antigen=CD61 GPIIIa ITGB3 Platelet membrane glycoprotein IIIa
Type:
Protein
Mol. Mass.:
87038.91
Organism:
Homo sapiens (Human)
Description:
P05106
Residue:
788
  
Inhibitor
Name:
BDBM50083764
Synonyms:
CHEMBL421533 | [3-Oxo-8-[3-(pyridin-2-ylamino)-propoxy]-2-(2,2,2-trifluoro-ethyl)-2,3,4,5-tetrahydro-1H-benzo[c]azepin-4-yl]-acetic acid
Type:
Small organic molecule
Emp. Form.:
C22H24F3N3O4
Mol. Mass.:
451.4389
SMILES:
OC(=O)CC1Cc2ccc(OCCCNc3ccccn3)cc2CN(CC(F)(F)F)C1=O
: