Target
Prothrombin
Ligand
BDBM50084068
Substrate
Meas. Tech.
ChEBML_208331
Ki
14±n/a nM
Citation
 Lu, TSoll, RMIllig, CRBone, RMurphy, LSpurlino, JSalemme, FRTomczuk, BE Structure-activity and crystallographic analysis of a new class of non-amide-based thrombin inhibitor. Bioorg Med Chem Lett 10:79-82 (2000)  
Target
Name:
Prothrombin
Synonyms:
Activation peptide fragment 1 Coagulation factor II Prothrombin precursor Thrombin heavy chain | Thrombin light chain
Type:
Protein
Mol. Mass.:
70029.57
Organism:
Homo sapiens (Human)
Description:
P00734
Residue:
622
  
Inhibitor
Name:
BDBM50084068
Synonyms:
2-Trifluoromethyl-benzenesulfonic acid 3-(1-carbamimidoyl-piperidin-4-ylmethoxy)-5-methyl-phenyl ester | CHEMBL166673
Type:
Small organic molecule
Emp. Form.:
C21H24F3N3O4S
Mol. Mass.:
471.493
SMILES:
Cc1cc(OCC2CCN(CC2)C(N)=N)cc(OS(=O)(=O)c2ccccc2C(F)(F)F)c1
: