Target
Diacylglycerol kinase alpha
Ligand
BDBM43868
Substrate
Meas. Tech.
ChEMBL_1910957 (CHEMBL4413403)
IC50
300±n/a nM
Citation
 Velnati, SRuffo, EMassarotti, ATalmon, MVarma, KSSGesu, AFresu, LGSnow, ALBertoni, ACapello, DTron, GCGraziani, ABaldanzi, G Identification of a novel DGK? inhibitor for XLP-1 therapy by virtual screening. Eur J Med Chem 164:378-390 (2019)  
Target
Name:
Diacylglycerol kinase alpha
Synonyms:
2.7.1.107 DAG kinase alpha DAGK1 DGKA Diacylglycerol kinase alpha | Diglyceride kinase alpha
Type:
PROTEIN
Mol. Mass.:
82631.86
Organism:
Homo sapiens
Description:
ChEMBL_117392
Residue:
735
  
Inhibitor
Name:
BDBM43868
Synonyms:
3-[2-[4-[bis(4-fluorophenyl)methylene]piperidino]ethyl]-2-thioxo-1H-quinazolin-4-one 3-[2-[4-[bis(4-fluorophenyl)methylidene]piperidin-1-yl]ethyl]-2-sulfanylidene-1H-quinazolin-4-one MLS000069510 SMR000058550 | cid_657356
Type:
Small organic molecule
Emp. Form.:
C28H25F2N3OS
Mol. Mass.:
489.579
SMILES:
Fc1ccc(cc1)C(=C1CCN(CCn2c(=S)[nH]c3ccccc3c2=O)CC1)c1ccc(F)cc1
: