Target
Endothelin-1 receptor
Ligand
BDBM50085833
Substrate
Meas. Tech.
ChEMBL_63363 (CHEMBL676099)
IC50
7±n/a nM
Citation
 Astles, PCBrown, TJHalley, FHandscombe, CMHarris, NVMajid, TNMcCarthy, CMcLay, IMMorley, APorter, BRoach, AGSargent, CSmith, CWalsh, RJ Selective ET(A) antagonists. 5. Discovery and structure-activity relationships of phenoxyphenylacetic acid derivatives. J Med Chem 43:900-10 (2000)  
Target
Name:
Endothelin-1 receptor
Synonyms:
EDNRA_RAT Ednra Endothelin-1 receptor
Type:
Enzyme Catalytic Domain
Mol. Mass.:
48256.91
Organism:
RAT
Description:
ENDOTHELIN A EDNRA RAT::P26684
Residue:
426
  
Inhibitor
Name:
BDBM50085833
Synonyms:
CHEMBL172144 | Sodium; [5-(benzo[1,3]dioxol-5-ylmethoxy)-2-cyano-phenoxy]-o-tolyl-acetate
Type:
Small organic molecule
Emp. Form.:
C24H18NO6
Mol. Mass.:
416.4034
SMILES:
Cc1ccccc1C(Oc1cc(OCc2ccc3OCOc3c2)ccc1C#N)C([O-])=O
: