Target
Endothelin-1 receptor
Ligand
BDBM50085864
Substrate
Meas. Tech.
ChEMBL_63363 (CHEMBL676099)
IC50
30±n/a nM
Citation
 Astles, PCBrown, TJHalley, FHandscombe, CMHarris, NVMajid, TNMcCarthy, CMcLay, IMMorley, APorter, BRoach, AGSargent, CSmith, CWalsh, RJ Selective ET(A) antagonists. 5. Discovery and structure-activity relationships of phenoxyphenylacetic acid derivatives. J Med Chem 43:900-10 (2000)  
Target
Name:
Endothelin-1 receptor
Synonyms:
EDNRA_RAT Ednra Endothelin-1 receptor
Type:
Enzyme Catalytic Domain
Mol. Mass.:
48256.91
Organism:
RAT
Description:
ENDOTHELIN A EDNRA RAT::P26684
Residue:
426
  
Inhibitor
Name:
BDBM50085864
Synonyms:
CHEMBL354740 | [2-Cyano-5-(thiazol-5-ylmethoxy)-phenoxy]-o-tolyl-acetic acid (H2O)
Type:
Small organic molecule
Emp. Form.:
C20H16N2O4S
Mol. Mass.:
380.417
SMILES:
Cc1ccccc1C(Oc1cc(OCc2cncs2)ccc1C#N)C(O)=O
: