Target
Adenosine receptor A1
Ligand
BDBM81925
Substrate
Meas. Tech.
ChEMBL_29120 (CHEMBL642254)
Ki
0.5±n/a nM
Citation
 Colotta, VCatarzi, DVarano, FCecchi, LFilacchioni, GMartini, CTrincavelli, LLucacchini, A 1,2,4-Triazolo[4,3-a]quinoxalin-1-one: a versatile tool for the synthesis of potent and selective adenosine receptor antagonists. J Med Chem 43:1158-64 (2000)  
Target
Name:
Adenosine receptor A1
Synonyms:
AA1R_BOVIN ADENOSINE A1 high ADORA1 | Adenosine A1 receptor
Type:
Enzyme Catalytic Domain
Mol. Mass.:
36602.99
Organism:
BOVINE
Description:
ADENOSINE 0 BOVINE::P28190
Residue:
326
  
Inhibitor
Name:
BDBM81925
Synonyms:
8-Cyclopentyl-1,3-dimethyl-3,7-dihydro-purine-2,6-dione CAS_1917 CPT | NSC_1917
Type:
Small organic molecule
Emp. Form.:
C12H16N4O2
Mol. Mass.:
248.281
SMILES:
Cn1c2nc([nH]c2c(=O)n(C)c1=O)C1CCCC1
: