Target
Mineralocorticoid receptor
Ligand
BDBM50531602
Substrate
Meas. Tech.
ChEMBL_1920445 (CHEMBL4423290)
Ki
3.2±n/a nM
Citation
 Granberg, KLYuan, ZQLindmark, BEdman, KKajanus, JHogner, AMalmgren, MO'Mahony, GNordqvist, ALindberg, JTångefjord, SKossenjans, MLöfberg, CBrånalt, JLiu, DSelmi, NNikitidis, GNordberg, PHayen, AAagaard, AHansson, EHermansson, MIvarsson, IJansson-Löfmark, RKarlsson, UJohansson, UWilliam-Olsson, LHartleib-Geschwindner, JBamberg, K Identification of Mineralocorticoid Receptor Modulators with Low Impact on Electrolyte Homeostasis but Maintained Organ Protection. J Med Chem 62:1385-1406 (2019)  
Target
Name:
Mineralocorticoid receptor
Synonyms:
MCR MLR NR3C2 | Nuclear receptor subfamily 3 group C member 2
Type:
Enzyme
Mol. Mass.:
107076.42
Organism:
Homo sapiens (Human)
Description:
P08235
Residue:
984
  
Inhibitor
Name:
BDBM50531602
Synonyms:
CHEMBL4581588
Type:
Small organic molecule
Emp. Form.:
C22H20FN3O5
Mol. Mass.:
425.4097
SMILES:
NC(=O)C[C@H]1COc2cc(F)c(cc2N1C(=O)c1ccc2OCC(=O)Nc2c1)C1CC1
: