Target
Alpha-1D adrenergic receptor
Ligand
BDBM50087473
Substrate
Meas. Tech.
ChEMBL_32731 (CHEMBL646002)
Ki
0.74±n/a nM
Citation
 Meyer, MDAltenbach, RJBasha, FZCarroll, WACondon, SElmore, SWKerwin, JFSippy, KBTietje, KWendt, MDHancock, AABrune, MEBuckner, SADrizin, I Structure-activity studies for a novel series of tricyclic substituted hexahydrobenz[e]isoindole alpha(1A) adrenoceptor antagonists as potential agents for the symptomatic treatment of benign prostatic hyperplasia (BPH). J Med Chem 43:1586-603 (2000)  
Target
Name:
Alpha-1D adrenergic receptor
Synonyms:
ADA1D_RAT Adra1d Alpha-1D adrenergic receptor | Serotonin 1a (5-HT1a) receptor/Adrenergic receptor alpha-1
Type:
Protein
Mol. Mass.:
59375.97
Organism:
Rattus norvegicus (Rat)
Description:
P23944
Residue:
561
  
Inhibitor
Name:
BDBM50087473
Synonyms:
3-[2-(6-Methoxy-1,3,3a,4,5,9b-hexahydro-benzo[e]isoindol-2-yl)-ethyl]-2,4-dioxo-1,2,3,4-tetrahydro-benzo[4,5]thieno[3,2-d]pyrimidine-7-carbonitrile | CHEMBL40780
Type:
Small organic molecule
Emp. Form.:
C26H24N4O3S
Mol. Mass.:
472.559
SMILES:
COc1cccc2[C@@H]3CN(CCn4c(=O)[nH]c5c6ccc(cc6sc5c4=O)C#N)C[C@@H]3CCc12
: