Target
Beta-2 adrenergic receptor
Ligand
BDBM50087512
Substrate
Meas. Tech.
ChEMBL_38610 (CHEMBL652293)
Ki
3700±n/a nM
Citation
 Lu, SFHerbert, BHaufe, GLaue, KWPadgett, WLOshunleti, ODaly, JWKirk, KL Syntheses of (R)- and (S)-2- and 6-fluoronorepinephrine and (R)- and (S)-2- and 6-fluoroepinephrine: effect of stereochemistry on fluorine-induced adrenergic selectivities. J Med Chem 43:1611-9 (2000)  
Target
Name:
Beta-2 adrenergic receptor
Synonyms:
ADRB2 | ADRB2_CANLF
Type:
PROTEIN
Mol. Mass.:
46593.67
Organism:
Canis familiaris
Description:
ChEMBL_56504
Residue:
415
  
Inhibitor
Name:
BDBM50087512
Synonyms:
(+)-adrenaline CHEMBL42280
Type:
Small organic molecule
Emp. Form.:
C9H13NO3
Mol. Mass.:
183.2044
SMILES:
CNC[C@@H](O)c1ccc(O)c(O)c1
: