Target
Coagulation factor X
Ligand
BDBM50087640
Substrate
Meas. Tech.
ChEMBL_48625 (CHEMBL659606)
IC50
1.37±n/a nM
Citation
 Tamura, SYLevy, OEUong, THReiner, JEGoldman, EAHo, JZCohen, CRBergum, PWNutt, RFBrunck, TKSemple, JE Guanylpiperidine peptidomimetics: potent and selective bis-cation inhibitors of factor Xa. Bioorg Med Chem Lett 10:745-9 (2000)  
Target
Name:
Coagulation factor X
Synonyms:
Activated coagulation factor X (FXa) Coagulation factor X precursor F10 Factor X heavy chain Factor Xa Stuart-Prower factor
Type:
Enzyme
Mol. Mass.:
54726.60
Organism:
Homo sapiens (Human)
Description:
Residue:
488
  
Inhibitor
Name:
BDBM50087640
Synonyms:
2-{[(R)-1-{[((S)-1-Carbamimidoyl-2-hydroxy-piperidin-3-ylcarbamoyl)-methyl]-carbamoyl}-2-(1-carbamimidoyl-piperidin-3-yl)-ethylsulfamoyl]-methyl}-benzoic acid methyl ester; TFA | CHEMBL352119
Type:
Small organic molecule
Emp. Form.:
C26H41N9O7S
Mol. Mass.:
623.725
SMILES:
COC(=O)c1ccccc1CS(=O)(=O)N[C@H](CC1CCCN(C1)C(N)=N)C(=O)NCC(=O)N[C@H]1CCCN(C1O)C(N)=N
: