Target
Serine protease 1
Ligand
BDBM50088935
Substrate
Meas. Tech.
ChEBML_212533
Ki
7.6±n/a nM
Citation
 Zhao, ZArnaiz, DOGriedel, BSakata, SDallas, JLWhitlow, MTrinh, LPost, JLiang, AMorrissey, MMShaw, KJ Design, synthesis, and in vitro biological activity of benzimidazole based factor Xa inhibitors. Bioorg Med Chem Lett 10:963-6 (2000)  
Target
Name:
Serine protease 1
Synonyms:
Beta-Trypsin PRSS1 TRY1 TRYP1 Trypsin I
Type:
Enzyme
Mol. Mass.:
25790.52
Organism:
Bos taurus (bovine)
Description:
P00760
Residue:
246
  
Inhibitor
Name:
BDBM50088935
Synonyms:
CHEMBL355097 | {[1-(7-Carbamimidoyl-naphthalen-2-ylmethyl)-2-methyl-1H-benzoimidazol-5-yl]-[1-(1-imino-ethyl)-piperidin-4-yl]-amino}-acetic acid methyl ester
Type:
Small organic molecule
Emp. Form.:
C30H35N7O2
Mol. Mass.:
525.6446
SMILES:
COC(=O)CN(C1CCN(CC1)C(C)=N)c1ccc2n(Cc3ccc4ccc(cc4c3)C(N)=N)c(C)nc2c1
: