Target
Serine protease 1
Ligand
BDBM50088944
Substrate
Meas. Tech.
ChEBML_212533
Ki
7±n/a nM
Citation
 Zhao, ZArnaiz, DOGriedel, BSakata, SDallas, JLWhitlow, MTrinh, LPost, JLiang, AMorrissey, MMShaw, KJ Design, synthesis, and in vitro biological activity of benzimidazole based factor Xa inhibitors. Bioorg Med Chem Lett 10:963-6 (2000)  
Target
Name:
Serine protease 1
Synonyms:
Beta-Trypsin PRSS1 TRY1 TRYP1 Trypsin I
Type:
Enzyme
Mol. Mass.:
25790.52
Organism:
Bos taurus (bovine)
Description:
P00760
Residue:
246
  
Inhibitor
Name:
BDBM50088944
Synonyms:
7-{2-tert-Butyl-6-[1-(1-imino-ethyl)-piperidin-4-yloxy]-benzoimidazol-1-ylmethyl}-naphthalene-2-carboxamidine | CHEMBL425132
Type:
Small organic molecule
Emp. Form.:
C30H36N6O
Mol. Mass.:
496.6464
SMILES:
CC(=N)N1CCC(CC1)Oc1ccc2nc(n(Cc3ccc4ccc(cc4c3)C(N)=N)c2c1)C(C)(C)C
: