Target
Coagulation factor X
Ligand
BDBM50088943
Substrate
Meas. Tech.
ChEBML_48831
Ki
6.3±n/a nM
Citation
 Zhao, ZArnaiz, DOGriedel, BSakata, SDallas, JLWhitlow, MTrinh, LPost, JLiang, AMorrissey, MMShaw, KJ Design, synthesis, and in vitro biological activity of benzimidazole based factor Xa inhibitors. Bioorg Med Chem Lett 10:963-6 (2000)  
Target
Name:
Coagulation factor X
Synonyms:
Activated coagulation factor X (FXa) Coagulation factor X precursor F10 Factor X heavy chain Factor Xa Stuart-Prower factor
Type:
Enzyme
Mol. Mass.:
54726.60
Organism:
Homo sapiens (Human)
Description:
Residue:
488
  
Inhibitor
Name:
BDBM50088943
Synonyms:
7-{5-[1-(1-Imino-ethyl)-piperidin-4-yloxy]-benzoimidazol-1-ylmethyl}-naphthalene-2-carboxamidine | CHEMBL172378
Type:
Small organic molecule
Emp. Form.:
C26H28N6O
Mol. Mass.:
440.5401
SMILES:
CC(=N)N1CCC(CC1)Oc1ccc2n(Cc3ccc4ccc(cc4c3)C(N)=N)cnc2c1
: