Target
Adenosine kinase
Ligand
BDBM50533825
Substrate
Meas. Tech.
ChEMBL_1927381 (CHEMBL4430453)
Ki
5440±n/a nM
Citation
 Köse, MSchiedel, ACBauer, AAPoschenrieder, HBurbiel, JCAkkinepally, RRStachel, HDMüller, CE Focused screening to identify new adenosine kinase inhibitors. Bioorg Med Chem 24:5127-5133 (2016)  
Target
Name:
Adenosine kinase
Synonyms:
ADK | ADK_HUMAN
Type:
PROTEIN
Mol. Mass.:
40545.97
Organism:
Homo sapiens (Human)
Description:
ChEMBL_1467841
Residue:
362
  
Inhibitor
Name:
BDBM50533825
Synonyms:
CHEMBL4460819
Type:
Small organic molecule
Emp. Form.:
C19H19N5S2
Mol. Mass.:
381.518
SMILES:
CC1CCc2sc3nc(NCc4ccccc4)n4c(S)nnc4c3c2C1
: