Target
Alpha-1A adrenergic receptor
Ligand
BDBM50090012
Substrate
Meas. Tech.
ChEMBL_33736 (CHEMBL647052)
Ki
0.3±n/a nM
Citation
 Barrow, JCNantermet, PGSelnick, HGGlass, KLRittle, KEGilbert, KFSteele, TGHomnick, CFFreidinger, RMRansom, RWKling, PReiss, DBroten, TPSchorn, TWChang, RSO'Malley, SSOlah, TVEllis, JDBarrish, AKassahun, KLeppert, PNagarathnam, DForray, C In vitro and in vivo evaluation of dihydropyrimidinone C-5 amides as potent and selective alpha(1A) receptor antagonists for the treatment of benign prostatic hyperplasia. J Med Chem 43:2703-18 (2000)  
Target
Name:
Alpha-1A adrenergic receptor
Synonyms:
ADA1A_HUMAN ADRA1C Alpha 1A-adrenoceptor Alpha adrenergic receptor 1a Alpha-adrenergic receptor 1c adrenergic Alpha1 | adrenergic Alpha1C
Type:
Cell-surface receptors
Mol. Mass.:
51511.67
Organism:
Homo sapiens (Human)
Description:
P35348
Residue:
466
  
Inhibitor
Name:
BDBM50090012
Synonyms:
4-(3,4-Difluoro-phenyl)-1,3-dimethyl-2-oxo-1,2,3,4-tetrahydro-pyrimidine-5-carboxylic acid {3-[4-cyano-4-(2-cyano-4-fluoro-phenyl)-piperidin-1-yl]-propyl}-amide | CHEMBL93843
Type:
Small organic molecule
Emp. Form.:
C29H29F3N6O2
Mol. Mass.:
550.5748
SMILES:
CN1C=C([C@H](N(C)C1=O)c1ccc(F)c(F)c1)C(=O)NCCCN1CCC(CC1)(C#N)c1ccc(F)cc1C#N
: