Target
Prostaglandin F2-alpha receptor
Ligand
BDBM50090134
Substrate
Meas. Tech.
ChEMBL_157958 (CHEMBL766820)
IC50
4400±n/a nM
Citation
 deLong, MAAmburgey, JTaylor, CWos, JASoper, DLWang, YHicks, R Synthesis and in vitro evaluation of human FP-receptor selective prostaglandin analogues. Bioorg Med Chem Lett 10:1519-22 (2000)  
Target
Name:
Prostaglandin F2-alpha receptor
Synonyms:
PF2R_HUMAN PGF2 alpha receptor PTGFR Prostanoid FP receptor
Type:
Enzyme
Mol. Mass.:
40072.29
Organism:
Homo sapiens (Human)
Description:
P43088
Residue:
359
  
Inhibitor
Name:
BDBM50090134
Synonyms:
7-[(1R,2R,3R,5S)-3,5-Dihydroxy-2-((R)-3-hydroxy-5-p-tolyl-pentyl)-cyclopentyl]-heptanoic acid | CHEMBL290571
Type:
Small organic molecule
Emp. Form.:
C24H38O5
Mol. Mass.:
406.5555
SMILES:
Cc1ccc(CC[C@H](O)CC[C@H]2[C@H](O)C[C@H](O)[C@@H]2CCCCCCC(O)=O)cc1
: