Target
Prostaglandin E2 receptor EP1 subtype
Ligand
BDBM50090143
Substrate
Meas. Tech.
ChEBML_157807
IC50
10000±n/a nM
Citation
 deLong, MAAmburgey, JTaylor, CWos, JASoper, DLWang, YHicks, R Synthesis and in vitro evaluation of human FP-receptor selective prostaglandin analogues. Bioorg Med Chem Lett 10:1519-22 (2000)  
Target
Name:
Prostaglandin E2 receptor EP1 subtype
Synonyms:
PE2R1_HUMAN PTGER1 Prostaglandin E2 receptor EP1 subtype Prostanoid EP1 receptor
Type:
Enzyme
Mol. Mass.:
41834.57
Organism:
Homo sapiens (Human)
Description:
P34995
Residue:
402
  
Inhibitor
Name:
BDBM50090143
Synonyms:
7-{(1R,2R,3R,5S)-2-[(R)-5-(3-Fluoro-phenyl)-3-hydroxy-pentyl]-3,5-dihydroxy-cyclopentyl}-heptanoic acid | CHEMBL289568
Type:
Small organic molecule
Emp. Form.:
C23H35FO5
Mol. Mass.:
410.5194
SMILES:
O[C@H](CC[C@H]1[C@H](O)C[C@H](O)[C@@H]1CCCCCCC(O)=O)CCc1cccc(F)c1
: