Target
Adenosine kinase
Ligand
BDBM50090887
Substrate
Meas. Tech.
ChEMBL_31116 (CHEMBL643544)
IC50
0.5±n/a nM
Citation
 Ugarkar, BGCastellino, AJDaRe, JMKopcho, JJWiesner, JBSchanzer, JMErion, MD Adenosine kinase inhibitors. 2. Synthesis, enzyme inhibition, and antiseizure activity of diaryltubercidin analogues. J Med Chem 43:2894-905 (2000)  
Target
Name:
Adenosine kinase
Synonyms:
ADK | ADK_HUMAN
Type:
PROTEIN
Mol. Mass.:
40545.97
Organism:
Homo sapiens (Human)
Description:
ChEMBL_1467841
Residue:
362
  
Inhibitor
Name:
BDBM50090887
Synonyms:
(1R,4S,5R)-2-Methyl-5-(5-phenyl-4-phenylamino-pyrrolo[2,3-d]pyrimidin-7-yl)-tetrahydro-furan-3,4-diol 2-Methyl-5-(5-phenyl-4-phenylamino-pyrrolo[2,3-d]pyrimidin-7-yl)-tetrahydro-furan-3,4-diol CHEMBL100421
Type:
Small organic molecule
Emp. Form.:
C23H22N4O3
Mol. Mass.:
402.4458
SMILES:
C[C@H]1O[C@H]([C@H](O)[C@@H]1O)n1cc(-c2ccccc2)c2c(Nc3ccccc3)ncnc12
: