Target
Proteasome subunit beta type-5
Ligand
BDBM50380997
Substrate
Meas. Tech.
ChEMBL_1930128 (CHEMBL4433379)
IC50
178±n/a nM
Citation
 Golonko, APienkowski, TSwislocka, RLazny, RRoszko, MLewandowski, W Another look at phenolic compounds in cancer therapy the effect of polyphenols on ubiquitin-proteasome system. Eur J Med Chem 167:291-311 (2019)  
Target
Name:
Proteasome subunit beta type-5
Synonyms:
3.4.25.1 Multicatalytic endopeptidase complex epsilon chain Proteasome chain 6 Proteasome subunit X Psmb5
Type:
PROTEIN
Mol. Mass.:
28586.62
Organism:
Rattus norvegicus
Description:
ChEMBL_118958
Residue:
263
  
Inhibitor
Name:
BDBM50380997
Synonyms:
BROUSSONIN B
Type:
Small organic molecule
Emp. Form.:
C16H18O3
Mol. Mass.:
258.3123
SMILES:
COc1cc(O)ccc1CCCc1ccc(O)cc1
: