Target
Protein kinase C alpha type
Ligand
BDBM50091249
Substrate
Meas. Tech.
ChEMBL_160434 (CHEMBL762305)
Ki
1.2±n/a nM
Citation
 Tamamura, HBienfait, BNacro, KLewin, NEBlumberg, PMMarquez, VE Conformationally constrained analogues of diacylglycerol (DAG). 17. Contrast between sn-1 and sn-2 DAG lactones in binding to protein kinase C. J Med Chem 43:3209-17 (2000)  
Target
Name:
Protein kinase C alpha type
Synonyms:
KPCA_HUMAN PKC alpha and beta-2 PKC-alpha PRKACA Protein Kinase C- alpha Protein kinase C alpha (PKCa) Protein kinase C alpha type (PRKCA) RAF proto-oncogene serine/threonine-protein kinase
Type:
Enzyme
Mol. Mass.:
76755.65
Organism:
Homo sapiens (Human)
Description:
The recombinant human PKC enzymes were produced using a baculovirus expression system in SF9 cells
Residue:
672
  
Inhibitor
Name:
BDBM50091249
Synonyms:
CHEMBL108303 | Nonanoic acid 2-hydroxy-1-(4-nonylidene-5-oxo-tetrahydro-furan-2-yl)-ethyl ester
Type:
Small organic molecule
Emp. Form.:
C24H42O5
Mol. Mass.:
410.5873
SMILES:
CCCCCCCC\C=C1/CC(OC1=O)[C@H](CO)OC(=O)CCCCCCCC
: