Target
Sodium- and chloride-dependent glycine transporter 1
Ligand
BDBM50149871
Substrate
Meas. Tech.
ChEMBL_1931014 (CHEMBL4434265)
IC50
14±n/a nM
Citation
 Fratev, FMiranda-Arango, MLopez, ABPadilla, ESirimulla, S Discovery of GlyT2 Inhibitors Using Structure-Based Pharmacophore Screening and Selectivity Studies by FEP+ Calculations. ACS Med Chem Lett 10:904-910 (2019)  
Target
Name:
Sodium- and chloride-dependent glycine transporter 1
Synonyms:
GlyT-1 Glycine Transporters (GlyT1c) SC6A9_HUMAN Sodium- and chloride-dependent glycine transporter 1 Sodium- and chloride-dependent glycine transporter 1 (GlyT1c) Solute carrier family 6 member 9
Type:
Enzyme
Mol. Mass.:
78270.54
Organism:
Homo sapiens (Human)
Description:
P48067
Residue:
706
  
Inhibitor
Name:
BDBM50149871
Synonyms:
(R)-2-((3-(biphenyl-4-yloxy)-3-(4-fluorophenyl)propyl)(methyl)amino)acetic acid {[(R)-3-(biphenyl-4-yloxy)-3-(4-fluoro-phenyl)-propyl]-methyl-amino}-acetic acid
Type:
Small organic molecule
Emp. Form.:
C24H24FNO3
Mol. Mass.:
393.4507
SMILES:
CN(CC[C@@H](Oc1ccc(cc1)-c1ccccc1)c1ccc(F)cc1)CC(O)=O
: