Target
Muscarinic acetylcholine receptor M3
Ligand
BDBM50092313
Substrate
Meas. Tech.
ChEBML_138712
Ki
0.160000±n/a nM
Citation
 Billard, WBinch, HBratzler, KChen, LYCrosby, GDuffy, RADugar, SLachowicz, JMcQuade, RPushpavanam, PRuperto, VBTaylor, LAClader, JW Diphenylsulfone muscarinic antagonists: piperidine derivatives with high M2 selectivity and improved potency. Bioorg Med Chem Lett 10:2209-12 (2001)  
Target
Name:
Muscarinic acetylcholine receptor M3
Synonyms:
ACM3_HUMAN Cholinergic, muscarinic M3 Muscarinic receptor M3 | RecName: Full=Muscarinic acetylcholine receptor M3
Type:
Enzyme
Mol. Mass.:
66151.03
Organism:
Homo sapiens (Human)
Description:
P20309
Residue:
590
  
Inhibitor
Name:
BDBM50092313
Synonyms:
1-Cyclohexyl-4-{1-[4-(4-methoxy-benzenesulfinyl)-phenyl]-ethyl}-piperidine | CHEMBL71124
Type:
Small organic molecule
Emp. Form.:
C26H35NO2S
Mol. Mass.:
425.627
SMILES:
COc1ccc(cc1)S(=O)c1ccc(cc1)C(C)C1CCN(CC1)C1CCCCC1
: