Target
Muscarinic acetylcholine receptor M2
Ligand
BDBM50092995
Substrate
Meas. Tech.
ChEBML_139763
Ki
0.800000±n/a nM
Citation
 Kozlowski, JALowe, DBGuzik, HSZhou, GRuperto, VBDuffy, RAMcQuade, RCrosby, GTaylor, LABillard, WBinch, HLachowicz, JE Diphenyl sulfoxides as selective antagonists of the muscarinic M2 receptor. Bioorg Med Chem Lett 10:2255-7 (2001)  
Target
Name:
Muscarinic acetylcholine receptor M2
Synonyms:
ACM2_HUMAN Cholinergic, muscarinic M2 Muscarinic acetylcholine receptor M2 and M5 | RecName: Full=Muscarinic acetylcholine receptor M2
Type:
GPCR
Mol. Mass.:
51730.61
Organism:
Homo sapiens (Human)
Description:
P08172
Residue:
466
  
Inhibitor
Name:
BDBM50092995
Synonyms:
1-Cyclohexyl-4-{1-[4-(toluene-4-sulfonyl)-phenyl]-ethyl}-piperazine | CHEMBL72455
Type:
Small organic molecule
Emp. Form.:
C25H34N2O2S
Mol. Mass.:
426.615
SMILES:
CC(N1CCN(CC1)C1CCCCC1)c1ccc(cc1)S(=O)(=O)c1ccc(C)cc1
: