Target
Coagulation factor X
Ligand
BDBM50093056
Substrate
Meas. Tech.
ChEMBL_160982 (CHEMBL769322)
IC50
9±n/a nM
Citation
 Semple, JELevy, OEMinami, NKOwens, TDSiev, DV Novel, potent and selective chimeric FXa inhibitors featuring hydrophobic P1-ketoamide moieties. Bioorg Med Chem Lett 10:2305-9 (2001)  
Target
Name:
Coagulation factor X
Synonyms:
Activated coagulation factor X (FXa) Coagulation factor X precursor F10 Factor X heavy chain Factor Xa Stuart-Prower factor
Type:
Enzyme
Mol. Mass.:
54726.60
Organism:
Homo sapiens (Human)
Description:
Residue:
488
  
Inhibitor
Name:
BDBM50093056
Synonyms:
(S)-N-Benzo[1,3]dioxol-5-ylmethyl-4-cyclohexyl-3-{2-[((R)-4-guanidino-2-phenylmethanesulfonylamino-butyryl)-methyl-amino]-acetylamino}-2-oxo-butyramide | CHEMBL74023
Type:
Small organic molecule
Emp. Form.:
C33H45N7O8S
Mol. Mass.:
699.817
SMILES:
CN(CC(=O)N[C@@H](CC1CCCCC1)C(=O)C(=O)NCc1ccc2OCOc2c1)C(=O)[C@@H](CCNC(N)=N)NS(=O)(=O)Cc1ccccc1
: