Target
Melatonin receptor type 1B
Ligand
BDBM50093290
Substrate
Meas. Tech.
ChEMBL_105244 (CHEMBL712574)
Ki
0.12±n/a nM
Citation
 Jellimann, CMathé-Allainmat, MAndrieux, JKloubert, SBoutin, JANicolas, JPBennejean, CDelagrange, PLanglois, M Synthesis of phenalene and acenaphthene derivatives as new conformationally restricted ligands for melatonin receptors. J Med Chem 43:4051-62 (2000)  
Target
Name:
Melatonin receptor type 1B
Synonyms:
MTNR1B Mel-1B-R Melatonin 1B Melatonin receptor type 1B | Melatonin receptor type 2 (MT2)
Type:
Enzyme
Mol. Mass.:
40203.54
Organism:
Homo sapiens (Human)
Description:
P49286
Residue:
362
  
Inhibitor
Name:
BDBM50093290
Synonyms:
CHEMBL130490 | N-(8-Methoxy-acenaphthen-1-ylmethyl)-acetamide
Type:
Small organic molecule
Emp. Form.:
C16H17NO2
Mol. Mass.:
255.3117
SMILES:
COc1ccc2cccc3CC(CNC(C)=O)c1c23
: