Target
Adenosine receptor A2b
Ligand
BDBM50094037
Substrate
Meas. Tech.
ChEMBL_30729 (CHEMBL648026)
Ki
>10000±n/a nM
Citation
 Todde, SMoresco, RMSimonelli, PBaraldi, PGCacciari, BSpalluto, GVarani, KMonopoli, AMatarrese, MCarpinelli, AMagni, FKienle, MGFazio, F Design, radiosynthesis, and biodistribution of a new potent and selective ligand for in vivo imaging of the adenosine A(2A) receptor system using positron emission tomography. J Med Chem 43:4359-62 (2000)  
Target
Name:
Adenosine receptor A2b
Synonyms:
AA2BR_HUMAN ADORA2B Adenosine receptors A2b | Adenosine receptors; A2a & A2b
Type:
G Protein-Coupled Receptor (GPCR)
Mol. Mass.:
36341.22
Organism:
Homo sapiens (Human)
Description:
Residue:
332
  
Inhibitor
Name:
BDBM50094037
Synonyms:
2-Furan-2-yl-7-[3-(4-methoxy-phenyl)-propyl]-7H-pyrazolo[4,3-e][1,2,4]triazolo[1,5-c]pyrimidin-5-ylamine SCH-442416
Type:
Small organic molecule
Emp. Form.:
C20H19N7O2
Mol. Mass.:
389.4106
SMILES:
COc1ccc(CCCn2ncc3c2nc(N)n2nc(nc32)-c2ccco2)cc1
: