Target
Vasopressin V1a receptor
Ligand
BDBM50029644
Substrate
Meas. Tech.
ChEMBL_214562 (CHEMBL820179)
Ki
32±n/a nM
Citation
 Kondo, KOgawa, HShinohara, TKurimura, MTanada, YKan, KYamashita, HNakamura, SHirano, TYamamura, YMori, TTominaga, MItai, A Novel design of nonpeptide AVP V(2) receptor agonists: structural requirements for an agonist having 1-(4-aminobenzoyl)-2,3,4, 5-tetrahydro-1H-1-benzazepine as a template. J Med Chem 43:4388-97 (2000)  
Target
Name:
Vasopressin V1a receptor
Synonyms:
Avpr1a VASOPRESSIN V1A Vasopressin V1a receptor | Vasopressin receptor
Type:
Enzyme Catalytic Domain
Mol. Mass.:
47674.81
Organism:
RAT
Description:
VASOPRESSIN V1A AVPR1A RAT::P30560
Residue:
424
  
Inhibitor
Name:
BDBM50029644
Synonyms:
CHEMBL296908 N-(3-{4-[4-(2-Oxo-3,4-dihydro-2H-quinolin-1-yl)-piperidine-1-carbonyl]-phenoxy}-propyl)-acetamide OPC-21268
Type:
Small organic molecule
Emp. Form.:
C26H31N3O4
Mol. Mass.:
449.542
SMILES:
CC(=O)NCCCOc1ccc(cc1)C(=O)N1CCC(CC1)N1C(=O)CCc2ccccc12
: