Target
Vasopressin V2 receptor
Ligand
BDBM50094083
Substrate
Meas. Tech.
ChEMBL_214707 (CHEMBL817841)
IC50
35±n/a nM
Citation
 Kondo, KOgawa, HShinohara, TKurimura, MTanada, YKan, KYamashita, HNakamura, SHirano, TYamamura, YMori, TTominaga, MItai, A Novel design of nonpeptide AVP V(2) receptor agonists: structural requirements for an agonist having 1-(4-aminobenzoyl)-2,3,4, 5-tetrahydro-1H-1-benzazepine as a template. J Med Chem 43:4388-97 (2000)  
Target
Name:
Vasopressin V2 receptor
Synonyms:
ADHR AVPR2 DIR Renal-type arginine vasopressin receptor V2R_HUMAN Vasopressin V2 receptor | Vasopressin receptor
Type:
Receptor
Mol. Mass.:
40295.28
Organism:
Homo sapiens (Human)
Description:
P30518
Residue:
371
  
Inhibitor
Name:
BDBM50094083
Synonyms:
(2-Chloro-4-methylamino-phenyl)-(2,3,4,5-tetrahydro-benzo[b]azepin-1-yl)-methanone | CHEMBL337098
Type:
Small organic molecule
Emp. Form.:
C18H19ClN2O
Mol. Mass.:
314.809
SMILES:
CNc1ccc(C(=O)N2CCCCc3ccccc23)c(Cl)c1
: