Target
5-hydroxytryptamine receptor 2A
Ligand
BDBM50094669
Substrate
Meas. Tech.
ChEMBL_2660 (CHEMBL617909)
Ki
33±n/a nM
Citation
 Blair, JBKurrasch-Orbaugh, DMarona-Lewicka, DCumbay, MGWatts, VJBarker, ELNichols, DE Effect of ring fluorination on the pharmacology of hallucinogenic tryptamines. J Med Chem 43:4701-10 (2001)  
Target
Name:
5-hydroxytryptamine receptor 2A
Synonyms:
5-HT-2A 5-HT2A 5-hydroxytryptamine receptor 2A (5HT2A) Htr2 Serotonin Receptor 2A
Type:
G Protein-Coupled Receptor (GPCR)
Mol. Mass.:
52852.05
Organism:
Rattus norvegicus (rat)
Description:
Rat cortex membranes 5-HT2A receptors.
Residue:
471
  
Inhibitor
Name:
BDBM50094669
Synonyms:
CHEMBL337590 | [2-(6-Fluoro-5-methoxy-1H-indol-3-yl)-ethyl]-dimethyl-amine
Type:
Small organic molecule
Emp. Form.:
C13H17FN2O
Mol. Mass.:
236.2853
SMILES:
COc1cc2c(CCN(C)C)c[nH]c2cc1F
: