Target
Adenosine receptor A2a
Ligand
BDBM50082425
Substrate
Meas. Tech.
ChEMBL_31825 (CHEMBL642246)
Ki
180±n/a nM
Citation
 Baraldi, PGCacciari, BRomagnoli, RSpalluto, GMoro, SKlotz, KNLeung, EVarani, KGessi, SMerighi, SBorea, PA Pyrazolo[4,3-e]1,2,4-triazolo[1,5-c]pyrimidine derivatives as highly potent and selective human A(3) adenosine receptor antagonists: influence of the chain at the N(8) pyrazole nitrogen. J Med Chem 43:4768-80 (2000)  
Target
Name:
Adenosine receptor A2a
Synonyms:
A2A adenosine receptor (hA2A) ADENOSINE A2 ADORA2 Adenosine A2A receptor (A2AAR)
Type:
G Protein-Coupled Receptor (GPCR)
Mol. Mass.:
44716.46
Organism:
Homo sapiens (Human)
Description:
P29274
Residue:
412
  
Inhibitor
Name:
BDBM50082425
Synonyms:
1-(3-Chloro-phenyl)-3-(8-ethyl-2-furan-2-yl-8H-pyrazolo[4,3-e][1,2,4]triazolo[1,5-c]pyrimidin-5-yl)-urea CHEMBL141154
Type:
Small organic molecule
Emp. Form.:
C19H15ClN8O2
Mol. Mass.:
422.828
SMILES:
CCn1cc2c(n1)nc(NC(=O)Nc1cccc(Cl)c1)n1nc(nc21)-c1ccco1
: