Target
Adenosine receptor A3
Ligand
BDBM50085371
Substrate
Meas. Tech.
ChEMBL_30029 (CHEMBL641320)
Ki
0.48±n/a nM
Citation
 Baraldi, PGCacciari, BRomagnoli, RSpalluto, GMoro, SKlotz, KNLeung, EVarani, KGessi, SMerighi, SBorea, PA Pyrazolo[4,3-e]1,2,4-triazolo[1,5-c]pyrimidine derivatives as highly potent and selective human A(3) adenosine receptor antagonists: influence of the chain at the N(8) pyrazole nitrogen. J Med Chem 43:4768-80 (2000)  
Target
Name:
Adenosine receptor A3
Synonyms:
A3 adenosine receptor (hA3) ADORA3 | Adenosine A3 receptor (A3AR)
Type:
G Protein-Coupled Receptor (GPCR)
Mol. Mass.:
36197.32
Organism:
Homo sapiens (Human)
Description:
P0DMS8
Residue:
318
  
Inhibitor
Name:
BDBM50085371
Synonyms:
1-(8-Allyl-2-furan-2-yl-8H-pyrazolo[4,3-e][1,2,4]triazolo[1,5-c]pyrimidin-5-yl)-3-(4-methoxy-phenyl)-urea | CHEMBL304726
Type:
Small organic molecule
Emp. Form.:
C21H18N8O3
Mol. Mass.:
430.4194
SMILES:
COc1ccc(NC(=O)Nc2nc3nn(CC=C)cc3c3nc(nn23)-c2ccco2)cc1
: