Target
Retinal dehydrogenase 2
Ligand
BDBM50538688
Substrate
Meas. Tech.
ChEMBL_1973875 (CHEMBL4606693)
Ki
920±n/a nM
Citation
 Quattrini, LGelardi, ELMPetrarolo, GColombo, GFerraris, DMPicarazzi, FRizzi, MGaravaglia, SLa Motta, C Progress in the Field of Aldehyde Dehydrogenase Inhibitors: Novel Imidazo[1,2- ACS Med Chem Lett 11:963-970 (2020)  
Target
Name:
Retinal dehydrogenase 2
Synonyms:
AL1A2_HUMAN Aldehyde dehydrogenase family 1 member A2 RALDH(II) Retinal dehydrogenase 2 | Retinaldehyde-specific dehydrogenase type 2
Type:
PROTEIN
Mol. Mass.:
56720.77
Organism:
Homo sapiens (Human)
Description:
ChEMBL_109700
Residue:
518
  
Inhibitor
Name:
BDBM50538688
Synonyms:
CHEMBL4642789
Type:
Small organic molecule
Emp. Form.:
C21H16N2O2
Mol. Mass.:
328.3639
SMILES:
COC(=O)c1ccc(cc1)-c1cccn2cc(nc12)-c1ccccc1
: