Target
Delta-type opioid receptor
Ligand
BDBM50096720
Substrate
Meas. Tech.
ChEBML_145890
IC50
624±n/a nM
Citation
 Sasaki, YHirabuki, MAmbo, AOuchi, HYamamoto, Y Enkephalin analogues with 2',6'-dimethylphenylalanine replacing phenylalanine in position 4. Bioorg Med Chem Lett 11:327-9 (2001)  
Target
Name:
Delta-type opioid receptor
Synonyms:
DOR-1 MSL-2 OPRD_MOUSE Oprd1
Type:
Enzyme Catalytic Domain
Mol. Mass.:
40577.25
Organism:
MOUSE
Description:
P32300
Residue:
372
  
Inhibitor
Name:
BDBM50096720
Synonyms:
(S)-2-[(R)-2-(2-{2-[(S)-2-Amino-3-(4-hydroxy-phenyl)-propionylamino]-acetylamino}-acetylamino)-3-(2,6-dimethyl-phenyl)-propionylamino]-4-methyl-pentanoic acid | CHEMBL109554
Type:
Small organic molecule
Emp. Form.:
C30H41N5O7
Mol. Mass.:
583.6758
SMILES:
CC(C)C[C@H](NC(=O)[C@@H](Cc1c(C)cccc1C)NC(=O)CNC(=O)CNC(=O)[C@@H](N)Cc1ccc(O)cc1)C(O)=O
: