Target
5-hydroxytryptamine receptor 1A
Ligand
BDBM29644
Substrate
Meas. Tech.
ChEMBL_948 (CHEMBL616127)
Ki
296±n/a nM
Citation
 Linnanen, TBrisander, MMohell, NJohansson, AM Serotonergic and dopaminergic activities of rigidified (R)-aporphine derivatives. Bioorg Med Chem Lett 11:367-70 (2001)  
Target
Name:
5-hydroxytryptamine receptor 1A
Synonyms:
5-HT-1A 5-hydroxytryptamine receptor 1A (5-HT-1A) ADRB2RL1 Dopamine D2 receptor and serotonin 1a receptor HTR1A | Serotonin receptor 1A
Type:
Mol. Mass.:
46122.49
Organism:
Homo sapiens (Human)
Description:
Residue:
422
  
Inhibitor
Name:
BDBM29644
Synonyms:
(6aR)-6-methyl-5,6,6a,7-tetrahydro-4H-dibenzo[de,g]quinoline-10,11-diol;hydrate;hydrochloride APOMORPHINE HYDROCHLORIDE HEMIHYDRATE SMR000059235 | cid_6852399
Type:
Small organic molecule
Emp. Form.:
C17H17NO2
Mol. Mass.:
267.3224
SMILES:
CN1CCc2cccc-3c2[C@H]1Cc1ccc(O)c(O)c-31
: