Target
5-hydroxytryptamine receptor 7
Ligand
BDBM50016777
Substrate
Meas. Tech.
ChEMBL_1983770 (CHEMBL4617176)
Ki
48±n/a nM
Citation
 Perry, CKCasey, ABFelsing, DEVemula, RZaka, MHerrington, NBCui, MKellogg, GECanal, CEBooth, RG Synthesis of novel 5-substituted-2-aminotetralin analogs: 5-HT Bioorg Med Chem 28:0 (2020)  
Target
Name:
5-hydroxytryptamine receptor 7
Synonyms:
5-HT-7 5-HT7 5-HT7S 5HT7 HTR7 | Serotonin receptor 7
Type:
G Protein-Coupled Receptor (GPCR)
Mol. Mass.:
53573.08
Organism:
Homo sapiens (Human)
Description:
P34969
Residue:
479
  
Inhibitor
Name:
BDBM50016777
Synonyms:
((R)-8-Hydroxy-1,2,3,4-tetrahydro-naphthalen-2-yl)-dipropyl-ammonium (R)-7-Dipropylamino-5,6,7,8-tetrahydro-naphthalen-1-ol 7-Dipropylamino-5,6,7,8-tetrahydro-naphthalen-1-ol ((R)-OH-DPAT) CHEMBL26998 | R-(+)-7-Dipropylamino-5,6,7,8-tetrahydro-naphthalen-1-ol
Type:
Small organic molecule
Emp. Form.:
C16H25NO
Mol. Mass.:
247.3758
SMILES:
CCCN(CCC)[C@@H]1CCc2cccc(O)c2C1
: