Target
Urokinase-type plasminogen activator
Ligand
BDBM50098137
Substrate
Meas. Tech.
ChEBML_213156
Ki
320±n/a nM
Citation
 Wilson, KJIllig, CRSubasinghe, NHoffman, JBRudolph, MJSoll, RMolloy, CJBone, RGreen, DRandall, TZhang, MLewandowski, FAZhou, ZSharp, CMaguire, DGrasberger, BDesJarlais, RLSpurlino, J Synthesis of thiophene-2-carboxamidines containing 2-aminothiazoles and their biological evaluation as urokinase inhibitors. Bioorg Med Chem Lett 11:915-8 (2001)  
Target
Name:
Urokinase-type plasminogen activator
Synonyms:
PLAU UROK_HUMAN Urokinase-type plasminogen activator (uPA) | Urokinase-type plasminogen activator/surface receptor
Type:
Enzyme
Mol. Mass.:
48528.62
Organism:
Homo sapiens (Human)
Description:
P00749
Residue:
431
  
Inhibitor
Name:
BDBM50098137
Synonyms:
2-amidino-4-iodobenzothiophene 4-iodobenzo[b]thiophene-2-carboximidamide CHEMBL60088
Type:
Small organic molecule
Emp. Form.:
C9H7IN2S
Mol. Mass.:
302.135
SMILES:
NC(=N)c1cc2c(I)cccc2s1
: