Target
Urokinase-type plasminogen activator
Ligand
BDBM50098147
Substrate
Meas. Tech.
ChEBML_213156
Ki
180±n/a nM
Citation
 Wilson, KJIllig, CRSubasinghe, NHoffman, JBRudolph, MJSoll, RMolloy, CJBone, RGreen, DRandall, TZhang, MLewandowski, FAZhou, ZSharp, CMaguire, DGrasberger, BDesJarlais, RLSpurlino, J Synthesis of thiophene-2-carboxamidines containing 2-aminothiazoles and their biological evaluation as urokinase inhibitors. Bioorg Med Chem Lett 11:915-8 (2001)  
Target
Name:
Urokinase-type plasminogen activator
Synonyms:
PLAU UROK_HUMAN Urokinase-type plasminogen activator (uPA) | Urokinase-type plasminogen activator/surface receptor
Type:
Enzyme
Mol. Mass.:
48528.62
Organism:
Homo sapiens (Human)
Description:
P00749
Residue:
431
  
Inhibitor
Name:
BDBM50098147
Synonyms:
4-[2-(4-Benzyloxy-phenylamino)-thiazol-4-yl]-5-methylsulfanyl-thiophene-2-carboxamidine | CHEMBL171353
Type:
Small organic molecule
Emp. Form.:
C22H20N4OS3
Mol. Mass.:
452.615
SMILES:
CSc1sc(cc1-c1csc(Nc2ccc(OCc3ccccc3)cc2)n1)C(N)=N
: