Target
Urokinase-type plasminogen activator
Ligand
BDBM50098148
Substrate
Meas. Tech.
ChEBML_213156
Ki
660.0±n/a nM
Citation
 Wilson, KJIllig, CRSubasinghe, NHoffman, JBRudolph, MJSoll, RMolloy, CJBone, RGreen, DRandall, TZhang, MLewandowski, FAZhou, ZSharp, CMaguire, DGrasberger, BDesJarlais, RLSpurlino, J Synthesis of thiophene-2-carboxamidines containing 2-aminothiazoles and their biological evaluation as urokinase inhibitors. Bioorg Med Chem Lett 11:915-8 (2001)  
Target
Name:
Urokinase-type plasminogen activator
Synonyms:
PLAU UROK_HUMAN Urokinase-type plasminogen activator (uPA) | Urokinase-type plasminogen activator/surface receptor
Type:
Enzyme
Mol. Mass.:
48528.62
Organism:
Homo sapiens (Human)
Description:
P00749
Residue:
431
  
Inhibitor
Name:
BDBM50098148
Synonyms:
4-[2-(2,5-Dimethoxy-phenylamino)-thiazol-4-yl]-5-methylsulfanyl-thiophene-2-carboxamidine | CHEMBL173065
Type:
Small organic molecule
Emp. Form.:
C17H18N4O2S3
Mol. Mass.:
406.545
SMILES:
COc1ccc(OC)c(Nc2nc(cs2)-c2cc(sc2SC)C(N)=N)c1
: