Target
Bromodomain-containing protein 4
Ligand
BDBM65454
Substrate
Meas. Tech.
ChEMBL_1985379 (CHEMBL4618785)
IC50
5190±n/a nM
Citation
 Kargbo, RB Ligand Design for Cereblon Based Immunomodulatory Therapy. ACS Med Chem Lett 11:1088-1089 (2020)  
Target
Name:
Bromodomain-containing protein 4
Synonyms:
BRD4 Bromodomain-containing protein 4 (BRD4) Protein HUNK1
Type:
Protein
Mol. Mass.:
152264.84
Organism:
Homo sapiens (Human)
Description:
O60885
Residue:
1362
  
Inhibitor
Name:
BDBM65454
Synonyms:
191732-72-6 Lenalidomide Revlimid US9694015, 6.1
Type:
Small organic molecule
Emp. Form.:
C13H13N3O3
Mol. Mass.:
259.2606
SMILES:
Nc1cccc2C(=O)N(Cc12)C1CCC(=O)NC1=O
: