Target
5-hydroxytryptamine receptor 2C
Ligand
BDBM50098535
Substrate
Meas. Tech.
ChEMBL_2822 (CHEMBL621508)
Ki
1.6±n/a nM
Citation
 Chambers, JJKurrasch-Orbaugh, DMParker, MANichols, DE Enantiospecific synthesis and pharmacological evaluation of a series of super-potent, conformationally restricted 5-HT(2A/2C) receptor agonists. J Med Chem 44:1003-10 (2001)  
Target
Name:
5-hydroxytryptamine receptor 2C
Synonyms:
5-HT2C 5-hydroxytryptamine receptor 2C (5HT2c) 5ht1c Htr2c Serotonin receptor 2a and 2c (5HT2A and 5HT2C)
Type:
Enzyme
Mol. Mass.:
51935.10
Organism:
Rattus norvegicus (Rat)
Description:
P08909
Residue:
460
  
Inhibitor
Name:
BDBM50098535
Synonyms:
1-Methyl-2-(8-trifluoromethyl-2,3,6,7-tetrahydro-benzo[1,2-b;4,5-b']difuran-4-yl)-ethyl-ammonium; chloride | CHEMBL268542
Type:
Small organic molecule
Emp. Form.:
C14H17F3NO2
Mol. Mass.:
288.2849
SMILES:
C[C@H]([NH3+])Cc1c2CCOc2c(c2CCOc12)C(F)(F)F
: