Target
Receptor-type tyrosine-protein phosphatase C
Ligand
BDBM50099714
Substrate
Meas. Tech.
ChEMBL_39938 (CHEMBL655779)
IC50
800±n/a nM
Citation
 Urbanek, RASuchard, SJSteelman, GBKnappenberger, KSSygowski, LAVeale, CAChapdelaine, MJ Potent reversible inhibitors of the protein tyrosine phosphatase CD45. J Med Chem 44:1777-93 (2001)  
Target
Name:
Receptor-type tyrosine-protein phosphatase C
Synonyms:
CD45 L-CA PTPRC Receptor-type tyrosine-protein phosphatase C (CD45) | T200
Type:
Protein
Mol. Mass.:
147474.19
Organism:
Homo sapiens (Human)
Description:
P08575
Residue:
1306
  
Inhibitor
Name:
BDBM50099714
Synonyms:
CHEMBL50846 | N-(9,10-Dioxo-9,10-dihydro-phenanthren-3-yl)-butyramide
Type:
Small organic molecule
Emp. Form.:
C18H15NO3
Mol. Mass.:
293.3166
SMILES:
CCCC(=O)Nc1ccc2C(=O)C(=O)c3ccccc3-c2c1
: