Target
Receptor-type tyrosine-protein phosphatase C
Ligand
BDBM50099723
Substrate
Meas. Tech.
ChEMBL_39938 (CHEMBL655779)
IC50
800±n/a nM
Citation
 Urbanek, RASuchard, SJSteelman, GBKnappenberger, KSSygowski, LAVeale, CAChapdelaine, MJ Potent reversible inhibitors of the protein tyrosine phosphatase CD45. J Med Chem 44:1777-93 (2001)  
Target
Name:
Receptor-type tyrosine-protein phosphatase C
Synonyms:
CD45 L-CA PTPRC Receptor-type tyrosine-protein phosphatase C (CD45) | T200
Type:
Protein
Mol. Mass.:
147474.19
Organism:
Homo sapiens (Human)
Description:
P08575
Residue:
1306
  
Inhibitor
Name:
BDBM50099723
Synonyms:
2-Thiophen-3-yl-phenanthrene-9,10-dione | CHEMBL51583
Type:
Small organic molecule
Emp. Form.:
C18H10O2S
Mol. Mass.:
290.336
SMILES:
O=C1C(=O)c2cc(ccc2-c2ccccc12)-c1ccsc1
: