Target
Receptor-type tyrosine-protein phosphatase C
Ligand
BDBM50099692
Substrate
Meas. Tech.
ChEMBL_39938 (CHEMBL655779)
IC50
200±n/a nM
Citation
 Urbanek, RASuchard, SJSteelman, GBKnappenberger, KSSygowski, LAVeale, CAChapdelaine, MJ Potent reversible inhibitors of the protein tyrosine phosphatase CD45. J Med Chem 44:1777-93 (2001)  
Target
Name:
Receptor-type tyrosine-protein phosphatase C
Synonyms:
CD45 L-CA PTPRC Receptor-type tyrosine-protein phosphatase C (CD45) | T200
Type:
Protein
Mol. Mass.:
147474.19
Organism:
Homo sapiens (Human)
Description:
P08575
Residue:
1306
  
Inhibitor
Name:
BDBM50099692
Synonyms:
CHEMBL51314 N-(9,10-Dioxo-9,10-dihydro-phenanthrene-2-yl)-2,2-dimethyl-propionamide | N-(9,10-dioxo-9,10-dihydrophenanthren-2-yl)-2,2-dimethylpropionamide
Type:
Small organic molecule
Emp. Form.:
C19H17NO3
Mol. Mass.:
307.3432
SMILES:
CC(C)(C)C(=O)Nc1ccc-2c(c1)C(=O)C(=O)c1ccccc-21
: