Target
Alpha-1B adrenergic receptor
Ligand
BDBM50100215
Substrate
Meas. Tech.
ChEMBL_34198 (CHEMBL649215)
Ki
1.01±n/a nM
Citation
 Meyer, MDAltenbach, RJBai, HBasha, FZCarroll, WAKerwin, JFLebold, SALee, EPratt, JKSippy, KBTietje, KWendt, MDBrune, MEBuckner, SAHancock, AADrizin, I Structure-activity studies for a novel series of bicyclic substituted hexahydrobenz[e]isoindole alpha1A adrenoceptor antagonists as potential agents for the symptomatic treatment of benign prostatic hyperplasia. J Med Chem 44:1971-85 (2001)  
Target
Name:
Alpha-1B adrenergic receptor
Synonyms:
ADA1B_HUMAN Adrenergic alpha1B Adrenergic receptor alpha Alpha 1B-adrenoreceptor | Alpha-1B adrenergic receptor
Type:
Enzyme
Mol. Mass.:
56862.13
Organism:
Homo sapiens (Human)
Description:
P35368
Residue:
520
  
Inhibitor
Name:
BDBM50100215
Synonyms:
3-[2-(6-Methoxy-1,3,3a,4,5,9b-hexahydro-benzo[e]isoindol-2-yl)-ethyl]-1H-thieno[3,4-d]pyrimidine-2,4-dione | CHEMBL445071
Type:
Small organic molecule
Emp. Form.:
C21H23N3O3S
Mol. Mass.:
397.491
SMILES:
COc1cccc2[C@@H]3CN(CCn4c(=O)[nH]c5cscc5c4=O)C[C@@H]3CCc12
: