Target
Adenosine kinase
Ligand
BDBM50095382
Substrate
Meas. Tech.
ChEMBL_31125 (CHEMBL643553)
IC50
773.0±n/a nM
Citation
 Lee, CHJiang, MCowart, MGfesser, GPerner, RKim, KHGu, YGWilliams, MJarvis, MFKowaluk, EAStewart, AOBhagwat, SS Discovery of 4-amino-5-(3-bromophenyl)-7-(6-morpholino-pyridin-3-yl)pyrido[2,3-d]pyrimidine, an orally active, non-nucleoside adenosine kinase inhibitor.. J Med Chem 44:2133-8 (2001)  
Target
Name:
Adenosine kinase
Synonyms:
ADENOSINE Adenosine 5-phosphotransferase Adenosine kinase | Adk
Type:
Enzyme
Mol. Mass.:
40130.14
Organism:
Rattus norvegicus (rat)
Description:
Rat brain cytosol as enzyme source.
Residue:
361
  
Inhibitor
Name:
BDBM50095382
Synonyms:
7-(4-Dimethylamino-phenyl)-pyrido[2,3-d]pyrimidin-4-ylamine | CHEMBL303499
Type:
Small organic molecule
Emp. Form.:
C15H15N5
Mol. Mass.:
265.3131
SMILES:
CN(C)c1ccc(cc1)-c1ccc2c(N)ncnc2n1
: