Target
Alpha-1D adrenergic receptor
Ligand
BDBM50101654
Substrate
Meas. Tech.
ChEMBL_216134 (CHEMBL816954)
Ki
0.25±n/a nM
Citation
 Barlocco, DCignarella, GPiaz, VDGiovannoni, MPDe Benedetti, PGFanelli, FMontesano, FPoggesi, ELeonardi, A Phenylpiperazinylalkylamino substituted pyridazinones as potent alpha(1) adrenoceptor antagonists. J Med Chem 44:2403-10 (2001)  
Target
Name:
Alpha-1D adrenergic receptor
Synonyms:
ADA1D_HUMAN ADRA1D Adrenergic receptor alpha Alpha 1D-adrenoreceptor Alpha-1D adrenoceptor adrenergic Alpha1D
Type:
Enzyme Catalytic Domain
Mol. Mass.:
60485.82
Organism:
Homo sapiens (Human)
Description:
adrenergic Alpha1D ADRA1D HUMAN::P25100
Residue:
572
  
Inhibitor
Name:
BDBM50101654
Synonyms:
5-Acetyl-4-{2-[4-(2-chloro-phenyl)-piperazin-1-yl]-ethylamino}-2-methyl-6-phenyl-2H-pyridazin-3-one | CHEMBL310599
Type:
Small organic molecule
Emp. Form.:
C25H28ClN5O2
Mol. Mass.:
465.975
SMILES:
CC(=O)c1c(NCCN2CCN(CC2)c2ccccc2Cl)c(=O)n(C)nc1-c1ccccc1
: