Target
Protein phosphatase 1 regulatory subunit 15B
Ligand
BDBM50545524
Substrate
Meas. Tech.
ChEMBL_1995425 (CHEMBL4629320)
IC50
33±n/a nM
Citation
 Cornella-Taracido, IGarcia-Echeverria, C Monovalent protein-degraders - Insights and future perspectives. Bioorg Med Chem Lett 30:0 (2020)  
Target
Name:
Protein phosphatase 1 regulatory subunit 15B
Synonyms:
PPP1R15B Protein phosphatase 1 regulatory subunit 15B
Type:
PROTEIN
Mol. Mass.:
79104.24
Organism:
Homo sapiens
Description:
ChEMBL_119923
Residue:
713
  
Inhibitor
Name:
BDBM50545524
Synonyms:
CHEMBL2369159
Type:
Small organic molecule
Emp. Form.:
C8H8Cl2N4
Mol. Mass.:
231.082
SMILES:
NC(=N)N\N=C\c1cccc(Cl)c1Cl
: